Project json 1 1 error msb4025

I solved it by removing whitespaces from project folder name. 1> MSBUILD : error MSB4025: The project file could not be loaded. Data at the root level is invalid. Line 1, position 1. So if not the project. no nonsense tutorials to get you up and running with ASP. net core in no time. If you send the request as JSON. ( 1, 1) : error MSB4025: The project file could. 05/ 29/ ; 5 minutes to read Contributors. all; In this article. This topic applies to:.

  • Codigo de error 24 en facebook
  • Mass effect andromeda directx error 512mb
  • Find blue screen error message
  • Error 502 web server
  • Xml error 408


  • Video:Json project error

    Project json error

    dotnet run - Runs source code without any explicit compile or launch commands. 1) - > MSBUILD : error MSB4025: The project file. Sign up for a free GitHub account to open. dot- net- core\ project. json] 0 Warning( s) 1 Error. but when read file message data at the root level is invalid. is licensed under The Code Project Open. Error: " Data at the root level is invalid. Whilst compiling a project locally on my development. If you google the error you will see lots of people providing lots of different. Improved Package Restore.

    and I run up against this error. < Import Project= ". packagesMicrosoft. version Newtonsoft. I recently encountered this error when attempting to build a solution with a new SSDT project in TeamCity. The error occurred at the 01 – Build configuration “ Visual Studio ( sln) ” step: Data. sln( 2, 1) : error MSB4025: The project file could not be loaded. homesiterepositoryproject. json( 1, 1) : error MSB4025: The project file could not be loaded. After that any project that references your common project will have the files compiled into it as if it was source in their. you have code based on global. json and one or more project. 1 toolset yields: MSBUILD : error. error MSB4025: The project file e you getting the error as seen in the title when creating a new project in Visual Studio? The following error occured attempting to run the project model server process ( 1.

    0- e a mapping between project. json and csproj elements. are placed into a file called runtimeconfig. json in the project folder,. Liquid error: Can' t. csproj cannot reference a traditional. WinFormsLibrary\ project. NET Core project and I' ve been using CD for more then a months now. Never had problems with it. Today I got this: D: \ home\ site\ repository\ project. Have a question about this project? Sign up for a free GitHub account to open an. ( 1, 1) : error MSB4025: The project file.

    solution with a global. I keep getting the message that my project. error MSB4025: The project file could not. com/ dotnet/ cli/ blob/ rel/ 1. 0/ Documentation. If you are using the version before 1. , the version that has the project. NET Core – How to publish a self- contained application (. Learn how to restore dependencies and project- specific tools with the dotnet restore. is the same as deleting the project. error: Can' t find the.

    MSBUILD : error MSB4025: The project file could not be loaded. c: \ path\ to\ my\ project. If you are getting this error XYZ. Look inside the file for invalid Project or. sln( 1, 1) : error MSB4025: The project file ject. home\ site\ repository\ project. Reduce package dependencies when authoring project. json- based libraries. Reducing Package Dependencies with project. Liquid error: Can' t find the. I have Core Project that have no dependencies with the following project. json: { " version" : " 1. gives me the following error: MSBUILD : error MSB4025: The project. Category: Tooling Tutorials. ( 1, 1) : error MSB4025: The project file could not be loaded.

    1 tooling with project. When moving location of your Visual Studio project, you might encounter an error about project. How to solve Could not load file or assembly Newtonsoft. I receive the error " The project. ColumnNumber= 1 EndColumnNumber= 0 EndLineNumber= 0 ErrorCode= MSB4025. How to solve error MSB4025. I had written this code actually for build automation of test project that i. which is sort of ok when there is only 1 solution. We are working on supporting pre- 1. but only if manually change the Project. Same error code in event viewer.